Reaction Details
TargetNischarin
LigandBDBM50334207
Substrate/Competitorn/a
Meas. Tech.ChEMBL_698560 (CHEMBL1647735)
Ki 93000±n/a nM
Citation Saczewski, FKornicka, AHudson, ALLaird, SScheinin, MLaurila, JMRybczynska, ABoblewski, KLehmann, AGdaniec, M 3-[(Imidazolidin-2-yl)imino]indazole ligands with selectivity for thea(2)-adrenoceptor compared to the imidazoline I(1) receptor. Bioorg Med Chem19:321-9 (2011) 
 
Nischarin
Name:Nischarin
Type:Enzyme Catalytic Domain
Mol. Mass.:166460.59
Organism:RAT
Description:Q4G017
Residue:1502
BDBM50334207
NameBDBM50334207
Synonyms:5-Chloro-3-[(imidazolidin-2-yl)imino]indazole hydrochloride | CHEMBL1641684
TypeSmall organic molecule
Emp. Form.C10H10ClN5
Mol. Mass.235.673
SMILESClc1ccc2n[nH]c(N=C3NCCN3)c2c1