Reaction Details
TargetSodium-dependent dopamine transporter
LigandBDBM50334210
Substrate/Competitorn/a
Meas. Tech.ChEMBL_698572 (CHEMBL1647747)
IC50 4627±n/a nM
Citation Lapinsky, DJVelagaleti, RYarravarapu, NLiu, YHuang, YSurratt, CKLever, JRFoster, JDAcharya, RVaughan, RADeutsch, HM Azido-iodo-N-benzyl derivatives of threo-methylphenidate (Ritalin, Concerta): Rational design, synthesis, pharmacological evaluation, and dopamine transporter photoaffinity labeling. Bioorg Med Chem19:504-12 (2011) 
 
Sodium-dependent dopamine transporter
Name:Sodium-dependent dopamine transporter
Type:Multi-pass membrane protein
Mol. Mass.:68497.11
Organism:Homo sapiens (Human)
Description:Q01959
Residue:620
BDBM50334210
NameBDBM50334210
Synonyms:(+/-)-threo-N-(m-Azido-benzyl)-3-iodomethylphenidate | CHEMBL1641696
TypeSmall organic molecule
Emp. Form.C21H23IN4O2
Mol. Mass.490.3374
SMILESCOC(=O)[C@@H]([C@H]1CCCCN1Cc1cccc(c1)N=[N+]=[N-])c1cccc(I)c1