Reaction Details
TargetSodium-dependent dopamine transporter
LigandBDBM50062915
Substrate/Competitorn/a
Meas. Tech.ChEMBL_698572 (CHEMBL1647747)
IC50 156±n/a nM
Citation Lapinsky, DJVelagaleti, RYarravarapu, NLiu, YHuang, YSurratt, CKLever, JRFoster, JDAcharya, RVaughan, RADeutsch, HM Azido-iodo-N-benzyl derivatives of threo-methylphenidate (Ritalin, Concerta): Rational design, synthesis, pharmacological evaluation, and dopamine transporter photoaffinity labeling. Bioorg Med Chem19:504-12 (2011) 
 
Sodium-dependent dopamine transporter
Name:Sodium-dependent dopamine transporter
Type:Multi-pass membrane protein
Mol. Mass.:68497.11
Organism:Homo sapiens (Human)
Description:Q01959
Residue:620
BDBM50062915
NameBDBM50062915
Synonyms:CHEMBL827 methyl (2R)-phenyl[(2R)-piperidin-2-yl]acetate | methyl (R)-phenyl[(R)-piperidin-2-yl]acetate
TypeSmall organic molecule
Emp. Form.C14H19NO2
Mol. Mass.233.3062
SMILESCOC(=O)[C@@H]([C@H]1CCCCN1)c1ccccc1