Reaction Details
TargetMyosin light chain kinase, smooth muscle
LigandBDBM50334225
Substrate/Competitorn/a
Meas. Tech.ChEMBL_699066 (CHEMBL1646347)
IC50 23600±n/a nM
Citation Rode, HBSos, MLGrütter, CHeynck, SSimard, JRRauh, D Synthesis and biological evaluation of 7-substituted-1-(3-bromophenylamino)isoquinoline-4-carbonitriles as inhibitors of myosin light chain kinase and epidermal growth factor receptor. Bioorg Med Chem19:429-39 (2011) 
 
Myosin light chain kinase, smooth muscle
Name:Myosin light chain kinase, smooth muscle
Type:Protein
Mol. Mass.:210702.56
Organism:Homo sapiens (Human)
Description:Q15746
Residue:1914
BDBM50334225
NameBDBM50334225
Synonyms:(E)-N-(1-(3-Bromophenylamino)-4-cyanoisoquinolin-7-yl)-4-(dimethylamino)but-2-enamide | CHEMBL1641990
TypeSmall organic molecule
Emp. Form.C22H20BrN5O
Mol. Mass.450.331
SMILESCN(C)C\C=C\C(=O)Nc1ccc2c(cnc(Nc3cccc(Br)c3)c2c1)C#N