Reaction Details
TargetMyosin light chain kinase, smooth muscle
LigandBDBM50216683
Substrate/Competitorn/a
Meas. Tech.ChEMBL_699066 (CHEMBL1646347)
Ki 300±n/a nM
Citation Rode, HBSos, MLGrütter, CHeynck, SSimard, JRRauh, D Synthesis and biological evaluation of 7-substituted-1-(3-bromophenylamino)isoquinoline-4-carbonitriles as inhibitors of myosin light chain kinase and epidermal growth factor receptor. Bioorg Med Chem19:429-39 (2011) 
 
Myosin light chain kinase, smooth muscle
Name:Myosin light chain kinase, smooth muscle
Type:Protein
Mol. Mass.:210702.56
Organism:Homo sapiens (Human)
Description:Q15746
Residue:1914
BDBM50216683
NameBDBM50216683
Synonyms:1-(5-iodonaphthalen-1-ylsulfonyl)-1,4-diazepane | CHEMBL249089
TypeSmall organic molecule
Emp. Form.C15H17IN2O2S
Mol. Mass.416.277
SMILESIc1cccc2c(cccc12)S(=O)(=O)N1CCCNCC1