Reaction Details
TargetEpidermal growth factor receptor
LigandBDBM50334221
Substrate/Competitorn/a
Meas. Tech.ChEMBL_699068 (CHEMBL1646349)
IC50 2200±n/a nM
Citation Rode, HBSos, MLGrütter, CHeynck, SSimard, JRRauh, D Synthesis and biological evaluation of 7-substituted-1-(3-bromophenylamino)isoquinoline-4-carbonitriles as inhibitors of myosin light chain kinase and epidermal growth factor receptor. Bioorg Med Chem19:429-39 (2011) 
 
Epidermal growth factor receptor
Name:Epidermal growth factor receptor
Type:Receptor Kinase Domain
Mol. Mass.:134279.59
Organism:Homo sapiens (Human)
Description:P00533
Residue:1210
BDBM50334221
NameBDBM50334221
Synonyms:(S)-N-(1-(3-Bromophenylamino)-4-cyanoisoquinolin-7-yl)-5-oxopyrrolidine-2-carboxamide | CHEMBL1641995
TypeSmall organic molecule
Emp. Form.C21H16BrN5O2
Mol. Mass.450.288
SMILESBrc1cccc(Nc2ncc(C#N)c3ccc(NC(=O)[C@@H]4CCC(=O)N4)cc23)c1