Reaction Details
TargetBile acid receptor
LigandBDBM50334234
Substrate/Competitorn/a
Meas. Tech.ChEMBL_699401 (CHEMBL1647428)
EC50 141±n/a nM
Citation Richter, HGBenson, GMBlum, DChaput, EFeng, SGardes, CGrether, UHartman, PKuhn, BMartin, REPlancher, JMRudolph, MGSchuler, FTaylor, SBleicher, KH Discovery of novel and orally active FXR agonists for the potential treatment of dyslipidemia& diabetes. Bioorg Med Chem Lett21:191-4 (2010) 
 
Bile acid receptor
Name:Bile acid receptor
Type:Nuclear Receptor
Mol. Mass.:55916.24
Organism:Homo sapiens (Human)
Description:Q96RI1
Residue:486
BDBM50334234
NameBDBM50334234
Synonyms:(S)-2-(6-chloro-2-(4-chlorophenyl)-5-fluoro-1H-benzo[d]imidazol-1-yl)-N,2-dicyclohexylacetamide | CHEMBL1642362
TypeSmall organic molecule
Emp. Form.C27H30Cl2FN3O
Mol. Mass.502.451
SMILESFc1cc2nc(-c3ccc(Cl)cc3)n([C@@H](C3CCCCC3)C(=O)NC3CCCCC3)c2cc1Cl