Reaction Details
TargetBile acid receptor
LigandBDBM50334236
Substrate/Competitorn/a
Meas. Tech.ChEMBL_699400 (CHEMBL1647427)
IC50 5720±n/a nM
Citation Richter, HGBenson, GMBlum, DChaput, EFeng, SGardes, CGrether, UHartman, PKuhn, BMartin, REPlancher, JMRudolph, MGSchuler, FTaylor, SBleicher, KH Discovery of novel and orally active FXR agonists for the potential treatment of dyslipidemia& diabetes. Bioorg Med Chem Lett21:191-4 (2010) 
 
Bile acid receptor
Name:Bile acid receptor
Type:Nuclear Receptor
Mol. Mass.:55916.24
Organism:Homo sapiens (Human)
Description:Q96RI1
Residue:486
BDBM50334236
NameBDBM50334236
Synonyms:2-(4-chlorophenyl)-1-(1-cyclohexyl-2-(cyclohexylamino)-2-oxoethyl)-1H-benzo[d]imidazole-6-carboxylic acid | CHEMBL1642360
TypeSmall organic molecule
Emp. Form.C28H32ClN3O3
Mol. Mass.494.025
SMILESOC(=O)c1ccc2nc(-c3ccc(Cl)cc3)n(C(C3CCCCC3)C(=O)NC3CCCCC3)c2c1