Reaction Details
TargetBile acid receptor
LigandBDBM50334246
Substrate/Competitorn/a
Meas. Tech.ChEMBL_699400 (CHEMBL1647427)
IC50 910±n/a nM
Citation Richter, HGBenson, GMBlum, DChaput, EFeng, SGardes, CGrether, UHartman, PKuhn, BMartin, REPlancher, JMRudolph, MGSchuler, FTaylor, SBleicher, KH Discovery of novel and orally active FXR agonists for the potential treatment of dyslipidemia& diabetes. Bioorg Med Chem Lett21:191-4 (2010) 
 
Bile acid receptor
Name:Bile acid receptor
Type:Nuclear Receptor
Mol. Mass.:55916.24
Organism:Homo sapiens (Human)
Description:Q96RI1
Residue:486
BDBM50334246
NameBDBM50334246
Synonyms:2-(2-(4-chlorophenyl)-1H-benzo[d]imidazol-1-yl)-N-cyclohexyl-4-methylhexanamide | CHEMBL1642350
TypeSmall organic molecule
Emp. Form.C26H32ClN3O
Mol. Mass.438.005
SMILESCCC(C)CC(C(=O)NC1CCCCC1)n1c(nc2ccccc12)-c1ccc(Cl)cc1