Reaction Details
Target5-hydroxytryptamine receptor 6
LigandBDBM50334257
Substrate/Competitorn/a
Meas. Tech.ChEMBL_699426 (CHEMBL1647453)
Ki 23.2±n/a nM
Citation Nirogi, RVDeshpande, ADKambhampati, RBadange, RKKota, LDaulatabad, AVShinde, AKAhmad, IKandikere, VJayarajan, PDubey, PK Indole-3-piperazinyl derivatives: novel chemical class of 5-HT(6) receptor antagonists. Bioorg Med Chem Lett21:346-9 (2010) 
 
5-hydroxytryptamine receptor 6
Name:5-hydroxytryptamine receptor 6
Type:G Protein-Coupled Receptor (GPCR)
Mol. Mass.:46968.43
Organism:Homo sapiens (Human)
Description:P50406
Residue:440
BDBM50334257
NameBDBM50334257
Synonyms:5-Bromo-1-(4-isopropylbenzenesulfonyl)-3-(4-methylpiperazin-1-yl)-1H-indole | CHEMBL1642421
TypeSmall organic molecule
Emp. Form.C22H26BrN3O2S
Mol. Mass.476.43
SMILESCC(C)c1ccc(cc1)S(=O)(=O)n1cc(N2CCN(C)CC2)c2cc(Br)ccc12