Reaction Details
Target5-hydroxytryptamine receptor 6
LigandBDBM50334262
Substrate/Competitorn/a
Meas. Tech.ChEMBL_699426 (CHEMBL1647453)
Ki 30.5±n/a nM
Citation Nirogi, RVDeshpande, ADKambhampati, RBadange, RKKota, LDaulatabad, AVShinde, AKAhmad, IKandikere, VJayarajan, PDubey, PK Indole-3-piperazinyl derivatives: novel chemical class of 5-HT(6) receptor antagonists. Bioorg Med Chem Lett21:346-9 (2010) 
 
5-hydroxytryptamine receptor 6
Name:5-hydroxytryptamine receptor 6
Type:G Protein-Coupled Receptor (GPCR)
Mol. Mass.:46968.43
Organism:Homo sapiens (Human)
Description:P50406
Residue:440
BDBM50334262
NameBDBM50334262
Synonyms:5-Chloro-1-(4-isopropylbenzenesulfonyl)-3-(4-ethylpiperazin-1-yl)-1H-indole | CHEMBL1642426
TypeSmall organic molecule
Emp. Form.C23H28ClN3O2S
Mol. Mass.446.005
SMILESCCN1CCN(CC1)c1cn(c2ccc(Cl)cc12)S(=O)(=O)c1ccc(cc1)C(C)C