Reaction Details
TargetBeta-carbonic anhydrase 1
LigandBDBM54376
Substrate/Competitorn/a
Meas. Tech.ChEMBL_700107 (CHEMBL1646989)
Ki 4.8±n/a nM
Citation Pacchiano, FCarta, FVullo, DScozzafava, ASupuran, CT Inhibition ofß-carbonic anhydrases with ureido-substituted benzenesulfonamides. Bioorg Med Chem Lett21:102-5 (2010) 
 
Beta-carbonic anhydrase 1
Name:Beta-carbonic anhydrase 1
Type:Enzyme
Mol. Mass.:18186.06
Organism:Mycobacterium tuberculosis
Description:The recombinant GST-mtCA1 construct was cloned, expressed, and further purified from E. coli. The purified protein was used in inhibition assays.
Residue:163
BDBM54376
NameBDBM54376
Synonyms:6-Hexyl-7-hydroxy-2-oxo-2H-chromene-3-carboxylic acid ethyl ester 6-hexyl-7-hydroxy-2-oxo-1-benzopyran-3-carboxylic acid ethyl ester SMR000413981 ethyl 6-hexyl-7-hydroxy-2-oxochromene-3-carboxylate | ethyl 6-hexyl-7-oxidanyl-2-oxidanylidene-chromene-3-carboxylate
TypeSmall organic molecule
Emp. Form.C18H22O5
Mol. Mass.318.3643
SMILESCCCCCCc1cc2cc(C(=O)OCC)c(=O)oc2cc1O