Reaction Details
TargetCarbonic anhydrase
LigandBDBM50334363
Substrate/Competitorn/a
Meas. Tech.ChEMBL_700108 (CHEMBL1646990)
Ki 64±n/a nM
Citation Pacchiano, FCarta, FVullo, DScozzafava, ASupuran, CT Inhibition ofß-carbonic anhydrases with ureido-substituted benzenesulfonamides. Bioorg Med Chem Lett21:102-5 (2010) 
 
Carbonic anhydrase
Name:Carbonic anhydrase
Synonyms:PROBABLE TRANSMEMBRANE CARBONIC ANHYDRASE (CARBONATE DEHYDRATASE) (CARBONIC DEHYDRATASE)
Type:PROTEIN
Mol. Mass.:80567.22
Organism:Mycobacterium tuberculosis
Description:ChEMBL_878775
Residue:764
BDBM50334363
NameBDBM50334363
TypeSmall organic molecule
Emp. Form.C17H21N3O3S
Mol. Mass.347.432
SMILESCCCCc1ccc(NC(=O)Nc2ccc(cc2)S(N)(=O)=O)cc1