Reaction Details
TargetNeuronal acetylcholine receptor subunit alpha-6
LigandBDBM50334464
Substrate/Competitorn/a
Meas. Tech.ChEMBL_701134 (CHEMBL1648232)
IC50 0.95±n/a nM
Citation Zhang, ZZheng, GPivavarchyk, MDeaciuc, AGDwoskin, LPCrooks, PA Novel bis-, tris-, and tetrakis-tertiary amino analogs as antagonists at neuronal nicotinic receptors that mediate nicotine-evoked dopamine release. Bioorg Med Chem Lett21:88-91 (2010) 
 
Neuronal acetylcholine receptor subunit alpha-6
Name:Neuronal acetylcholine receptor subunit alpha-6
Type:PROTEIN
Mol. Mass.:56943.53
Organism:Rattus norvegicus
Description:ChEMBL_1454451
Residue:493
BDBM50334464
NameBDBM50334464
Synonyms:1,12-bis(3-methyl-5,6-dihydropyridin-1(2H)-yl)dodecane | CHEMBL1643941
TypeSmall organic molecule
Emp. Form.C24H44N2
Mol. Mass.360.6196
SMILESCC1=CCCN(CCCCCCCCCCCCN2CCC=C(C)C2)C1