Reaction Details
TargetNeuronal acetylcholine receptor subunit alpha-6
LigandBDBM50334466
Substrate/Competitorn/a
Meas. Tech.ChEMBL_701134 (CHEMBL1648232)
IC50 3.22±n/a nM
Citation Zhang, ZZheng, GPivavarchyk, MDeaciuc, AGDwoskin, LPCrooks, PA Novel bis-, tris-, and tetrakis-tertiary amino analogs as antagonists at neuronal nicotinic receptors that mediate nicotine-evoked dopamine release. Bioorg Med Chem Lett21:88-91 (2010) 
 
Neuronal acetylcholine receptor subunit alpha-6
Name:Neuronal acetylcholine receptor subunit alpha-6
Type:PROTEIN
Mol. Mass.:56943.53
Organism:Rattus norvegicus
Description:ChEMBL_1454451
Residue:493
BDBM50334466
NameBDBM50334466
Synonyms:1,3,5-tris(5-(3-methyl-5,6-dihydropyridin-1(2H)-yl)pent-1-ynyl)benzene | CHEMBL1643942
TypeSmall organic molecule
Emp. Form.C39H51N3
Mol. Mass.561.8423
SMILESCC1=CCCN(CCCC#Cc2cc(cc(c2)C#CCCCN2CCC=C(C)C2)C#CCCCN2CCC=C(C)C2)C1