Reaction Details
TargetNeuronal acetylcholine receptor subunit alpha-6
LigandBDBM50334473
Substrate/Competitorn/a
Meas. Tech.ChEMBL_701134 (CHEMBL1648232)
IC50 205±n/a nM
Citation Zhang, ZZheng, GPivavarchyk, MDeaciuc, AGDwoskin, LPCrooks, PA Novel bis-, tris-, and tetrakis-tertiary amino analogs as antagonists at neuronal nicotinic receptors that mediate nicotine-evoked dopamine release. Bioorg Med Chem Lett21:88-91 (2010) 
 
Neuronal acetylcholine receptor subunit alpha-6
Name:Neuronal acetylcholine receptor subunit alpha-6
Type:PROTEIN
Mol. Mass.:56943.53
Organism:Rattus norvegicus
Description:ChEMBL_1454451
Residue:493
BDBM50334473
NameBDBM50334473
Synonyms:1,2,4,5-tetrakis(5-(3,4-dihydroisoquinolin-2(1H)-yl)pentyl)benzene | CHEMBL1643949
TypeSmall organic molecule
Emp. Form.C62H82N4
Mol. Mass.883.3413
SMILESC(CCN1CCc2ccccc2C1)CCc1cc(CCCCCN2CCc3ccccc3C2)c(CCCCCN2CCc3ccccc3C2)cc1CCCCCN1CCc2ccccc2C1