Reaction Details
TargetCannabinoid receptor 2
LigandBDBM50334576
Substrate/Competitorn/a
Meas. Tech.ChEMBL_698537 (CHEMBL1647712)
EC50 158±n/a nM
Citation El Bakali, JMuccioli, GGRenault, NPradal, DBody-Malapel, MDjouina, MHamtiaux, LAndrzejak, VDesreumaux, PChavatte, PLambert, DMMillet, R 4-Oxo-1,4-dihydropyridines as selective CB2 cannabinoid receptor ligands: structural insights into the design of a novel inverse agonist series. J Med Chem53:7918-31 (2010) 
 
Cannabinoid receptor 2
Name:Cannabinoid receptor 2
Type:G Protein-Coupled Receptor (GPCR)
Mol. Mass.:39690.94
Organism:Homo sapiens (Human)
Description:P34972
Residue:360
BDBM50334576
NameBDBM50334576
Synonyms:6-(4-Chlorophenyl)-4-oxo-1-pentyl-N3-(3(trifluoromethyl)phenyl)-1,4-dihydropyridine-3-carboxamide | CHEMBL1641954
TypeSmall organic molecule
Emp. Form.C24H22ClF3N2O2
Mol. Mass.462.892
SMILESCCCCCn1cc(C(=O)Nc2cccc(c2)C(F)(F)F)c(=O)cc1-c1ccc(Cl)cc1