Reaction Details
TargetCannabinoid receptor 2
LigandBDBM50334579
Substrate/Competitorn/a
Meas. Tech.ChEMBL_698537 (CHEMBL1647712)
EC50 164±n/a nM
Citation El Bakali, JMuccioli, GGRenault, NPradal, DBody-Malapel, MDjouina, MHamtiaux, LAndrzejak, VDesreumaux, PChavatte, PLambert, DMMillet, R 4-Oxo-1,4-dihydropyridines as selective CB2 cannabinoid receptor ligands: structural insights into the design of a novel inverse agonist series. J Med Chem53:7918-31 (2010) 
 
Cannabinoid receptor 2
Name:Cannabinoid receptor 2
Type:G Protein-Coupled Receptor (GPCR)
Mol. Mass.:39690.94
Organism:Homo sapiens (Human)
Description:P34972
Residue:360
BDBM50334579
NameBDBM50334579
Synonyms:CHEMBL1641961 | tert-Butyl 4-Oxo-1-pentyl-6-phenyl-1,4-dihydropyridin-3-ylcarbamate
TypeSmall organic molecule
Emp. Form.C21H28N2O3
Mol. Mass.356.4586
SMILESCCCCCn1cc(NC(=O)OC(C)(C)C)c(=O)cc1-c1ccccc1