Reaction Details
TargetCannabinoid receptor 2
LigandBDBM50334581
Substrate/Competitorn/a
Meas. Tech.ChEMBL_698537 (CHEMBL1647712)
EC50 145.6±n/a nM
Citation El Bakali, JMuccioli, GGRenault, NPradal, DBody-Malapel, MDjouina, MHamtiaux, LAndrzejak, VDesreumaux, PChavatte, PLambert, DMMillet, R 4-Oxo-1,4-dihydropyridines as selective CB2 cannabinoid receptor ligands: structural insights into the design of a novel inverse agonist series. J Med Chem53:7918-31 (2010) 
 
Cannabinoid receptor 2
Name:Cannabinoid receptor 2
Type:G Protein-Coupled Receptor (GPCR)
Mol. Mass.:39690.94
Organism:Homo sapiens (Human)
Description:P34972
Residue:360
BDBM50334581
NameBDBM50334581
Synonyms:(6aR,10aR)-6,6-dimethyl-3-(2-methylpentan-2-yl)-6a,7,10,10a-tetrahydro-6H-benzo[c]chromen-9-ol | CHEMBL1641963
TypeSmall organic molecule
Emp. Form.C21H30O2
Mol. Mass.314.4617
SMILESCCCC(C)(C)c1ccc2[C@@H]3CC(=O)CC[C@H]3C(C)(C)Oc2c1