Reaction Details
TargetCannabinoid receptor 1
LigandBDBM50334573
Substrate/Competitorn/a
Meas. Tech.ChEMBL_698534 (CHEMBL1647709)
Ki>3000±n/a nM
Citation El Bakali, JMuccioli, GGRenault, NPradal, DBody-Malapel, MDjouina, MHamtiaux, LAndrzejak, VDesreumaux, PChavatte, PLambert, DMMillet, R 4-Oxo-1,4-dihydropyridines as selective CB2 cannabinoid receptor ligands: structural insights into the design of a novel inverse agonist series. J Med Chem53:7918-31 (2010) 
 
Cannabinoid receptor 1
Name:Cannabinoid receptor 1
Type:G Protein-Coupled Receptor (GPCR)
Mol. Mass.:52868.96
Organism:Homo sapiens (Human)
Description:P21554
Residue:472
BDBM50334573
NameBDBM50334573
Synonyms:4-Oxo-1-pentyl-6-phenyl-N3-(3(trifluoromethyl)phenyl)-1,4-dihydropyridine-3-carboxamide | CHEMBL1641951
TypeSmall organic molecule
Emp. Form.C24H23F3N2O2
Mol. Mass.428.4468
SMILESCCCCCn1cc(C(=O)Nc2cccc(c2)C(F)(F)F)c(=O)cc1-c1ccccc1