Reaction Details
TargetCannabinoid receptor 2
LigandBDBM50334571
Substrate/Competitorn/a
Meas. Tech.ChEMBL_698535 (CHEMBL1647710)
Ki 369±n/a nM
Citation El Bakali, JMuccioli, GGRenault, NPradal, DBody-Malapel, MDjouina, MHamtiaux, LAndrzejak, VDesreumaux, PChavatte, PLambert, DMMillet, R 4-Oxo-1,4-dihydropyridines as selective CB2 cannabinoid receptor ligands: structural insights into the design of a novel inverse agonist series. J Med Chem53:7918-31 (2010) 
 
Cannabinoid receptor 2
Name:Cannabinoid receptor 2
Type:G Protein-Coupled Receptor (GPCR)
Mol. Mass.:39690.94
Organism:Homo sapiens (Human)
Description:P34972
Residue:360
BDBM50334571
NameBDBM50334571
Synonyms:(S)-4-Oxo-1-pentyl-6-phenyl-N3-(1-(1,2,3,4-tetrahydronaphthyl))-1,4-dihydropyridine-3-carboxamide | CHEMBL1641949
TypeSmall organic molecule
Emp. Form.C27H30N2O2
Mol. Mass.414.5393
SMILESCCCCCn1cc(C(=O)N[C@H]2CCCc3ccccc23)c(=O)cc1-c1ccccc1