Reaction Details
TargetCannabinoid receptor 2
LigandBDBM50334580
Substrate/Competitorn/a
Meas. Tech.ChEMBL_698535 (CHEMBL1647710)
Ki 51±n/a nM
Citation El Bakali, JMuccioli, GGRenault, NPradal, DBody-Malapel, MDjouina, MHamtiaux, LAndrzejak, VDesreumaux, PChavatte, PLambert, DMMillet, R 4-Oxo-1,4-dihydropyridines as selective CB2 cannabinoid receptor ligands: structural insights into the design of a novel inverse agonist series. J Med Chem53:7918-31 (2010) 
 
Cannabinoid receptor 2
Name:Cannabinoid receptor 2
Type:G Protein-Coupled Receptor (GPCR)
Mol. Mass.:39690.94
Organism:Homo sapiens (Human)
Description:P34972
Residue:360
BDBM50334580
NameBDBM50334580
Synonyms:CHEMBL1641962 | N-(4-Oxo-1-pentyl-6-phenyl-1,4-dihydropyridin-3-yl)cyclohexanecarboxamide
TypeSmall organic molecule
Emp. Form.C23H30N2O2
Mol. Mass.366.4965
SMILESCCCCCn1cc(NC(=O)C2CCCCC2)c(=O)cc1-c1ccccc1