Reaction Details
TargetcAMP and cAMP-inhibited cGMP 3',5'-cyclic phosphodiesterase 10A
LigandBDBM50334661
Substrate/Competitorn/a
Meas. Tech.ChEMBL_699035 (CHEMBL1646316)
IC50 76±n/a nM
Citation Asproni, BMurineddu, GPau, APinna, GALanggård, MChristoffersen, CTNielsen, JKehler, J Synthesis and SAR study of new phenylimidazole-pyrazolo[1,5-c]quinazolines as potent phosphodiesterase 10A inhibitors. Bioorg Med Chem19:642-9 (2011) 
 
cAMP and cAMP-inhibited cGMP 3',5'-cyclic phosphodiesterase 10A
Name:cAMP and cAMP-inhibited cGMP 3',5'-cyclic phosphodiesterase 10A
Type:Protein
Mol. Mass.:88412.52
Organism:Homo sapiens (Human)
Description:Q9Y233
Residue:779
BDBM50334661
NameBDBM50334661
Synonyms:2,9-Dimethyl-5-((1-methyl-4-phenyl-1H-imidazol-2-ylthio)methyl)pyrazolo[1,5-c]quinazoline | CHEMBL1642577
TypeSmall organic molecule
Emp. Form.C23H21N5S
Mol. Mass.399.511
SMILESCc1cc2c3cc(C)ccc3nc(CSc3nc(cn3C)-c3ccccc3)n2n1