Reaction Details
TargetcAMP and cAMP-inhibited cGMP 3',5'-cyclic phosphodiesterase 10A
LigandBDBM50334665
Substrate/Competitorn/a
Meas. Tech.ChEMBL_699035 (CHEMBL1646316)
IC50 16±n/a nM
Citation Asproni, BMurineddu, GPau, APinna, GALanggård, MChristoffersen, CTNielsen, JKehler, J Synthesis and SAR study of new phenylimidazole-pyrazolo[1,5-c]quinazolines as potent phosphodiesterase 10A inhibitors. Bioorg Med Chem19:642-9 (2011) 
 
cAMP and cAMP-inhibited cGMP 3',5'-cyclic phosphodiesterase 10A
Name:cAMP and cAMP-inhibited cGMP 3',5'-cyclic phosphodiesterase 10A
Type:Protein
Mol. Mass.:88412.52
Organism:Homo sapiens (Human)
Description:Q9Y233
Residue:1055
BDBM50334665
NameBDBM50334665
Synonyms:9-Chloro-2-methyl-5-(2-(1-methyl-4-phenyl-1H-imidazol-2-yl)ethyl)pyrazolo[1,5-c]quinazoline | CHEMBL1642581
TypeSmall organic molecule
Emp. Form.C23H20ClN5
Mol. Mass.401.891
SMILESCc1cc2c3cc(Cl)ccc3nc(CCc3nc(cn3C)-c3ccccc3)n2n1