Reaction Details
TargetcAMP-specific 3',5'-cyclic phosphodiesterase 4D
LigandBDBM50334670
Substrate/Competitorn/a
Meas. Tech.ChEMBL_699039 (CHEMBL1646320)
IC50 10000±n/a nM
Citation Asproni, BMurineddu, GPau, APinna, GALanggård, MChristoffersen, CTNielsen, JKehler, J Synthesis and SAR study of new phenylimidazole-pyrazolo[1,5-c]quinazolines as potent phosphodiesterase 10A inhibitors. Bioorg Med Chem19:642-9 (2011) 
 
cAMP-specific 3',5'-cyclic phosphodiesterase 4D
Name:cAMP-specific 3',5'-cyclic phosphodiesterase 4D
Type:Protein
Mol. Mass.:91092.69
Organism:Homo sapiens (Human)
Description:Q08499
Residue:809
BDBM50334670
NameBDBM50334670
Synonyms:2,9-Dimethyl-5-(2-(1-methyl-4-phenyl-1H-imidazol-2-yl)ethyl)pyrazolo[1,5-c]quinazoline | CHEMBL1642568
TypeSmall organic molecule
Emp. Form.C24H23N5
Mol. Mass.381.4729
SMILESCc1cc2c3cc(C)ccc3nc(CCc3nc(cn3C)-c3ccccc3)n2n1