Reaction Details
Target5-hydroxytryptamine receptor 6
LigandBDBM50334716
Substrate/Competitorn/a
Meas. Tech.ChEMBL_699278 (CHEMBL1647098)
Ki 1.7±n/a nM
Citation Liu, KGRobichaud, AJGreenfield, AALo, JRGrosanu, CMattes, JFCai, YZhang, GMZhang, JYKowal, DMSmith, DLDi, LKerns, EHSchechter, LEComery, TA Identification of 3-sulfonylindazole derivatives as potent and selective 5-HT(6) antagonists. Bioorg Med Chem19:650-62 (2011) 
 
5-hydroxytryptamine receptor 6
Name:5-hydroxytryptamine receptor 6
Type:G Protein-Coupled Receptor (GPCR)
Mol. Mass.:46968.43
Organism:Homo sapiens (Human)
Description:P50406
Residue:440
BDBM50334716
NameBDBM50334716
Synonyms:3-(Naphthalen-1-ylsulfonyl)-N-(piperidin-5-yl)-1H-indazol-4-amine HCl | CHEMBL1642852
TypeSmall organic molecule
Emp. Form.C22H22N4O2S
Mol. Mass.406.501
SMILESO=S(=O)(c1n[nH]c2ccc(NC3CCCNC3)cc12)c1cccc2ccccc12