Reaction Details
Target5-hydroxytryptamine receptor 6
LigandBDBM50334725
Substrate/Competitorn/a
Meas. Tech.ChEMBL_699278 (CHEMBL1647098)
Ki 1.1±n/a nM
Citation Liu, KGRobichaud, AJGreenfield, AALo, JRGrosanu, CMattes, JFCai, YZhang, GMZhang, JYKowal, DMSmith, DLDi, LKerns, EHSchechter, LEComery, TA Identification of 3-sulfonylindazole derivatives as potent and selective 5-HT(6) antagonists. Bioorg Med Chem19:650-62 (2011) 
 
5-hydroxytryptamine receptor 6
Name:5-hydroxytryptamine receptor 6
Type:G Protein-Coupled Receptor (GPCR)
Mol. Mass.:46968.43
Organism:Homo sapiens (Human)
Description:P50406
Residue:440
BDBM50334725
NameBDBM50334725
Synonyms:CHEMBL1642866 | N-(3-(Naphthalen-1-ylsulfonyl)-1H-indazol-5-yl)piperidine-4-carboxamide HCl
TypeSmall organic molecule
Emp. Form.C23H22N4O3S
Mol. Mass.434.511
SMILESO=C(Nc1ccc2[nH]nc(c2c1)S(=O)(=O)c1cccc2ccccc12)C1CCNCC1