Reaction Details
TargetSodium-dependent serotonin transporter
LigandBDBM50243895
Substrate/Competitorn/a
Meas. Tech.ChEMBL_699304 (CHEMBL1647124)
IC50 12.0±n/a nM
Citation Shao, LWang, FMalcolm, SCMa, JHewitt, MCCampbell, UCBush, LRSpicer, NAEngel, SRSaraswat, LDHardy, LWKoch, PSchreiber, RSpear, KLVarney, MA Synthesis and pharmacological evaluation of 4-(3,4-dichlorophenyl)-N-methyl-1,2,3,4-tetrahydronaphthalenyl amines as triple reuptake inhibitors. Bioorg Med Chem19:663-76 (2011) 
 
Sodium-dependent serotonin transporter
Name:Sodium-dependent serotonin transporter
Type:Multi-pass membrane protein
Mol. Mass.:70322.51
Organism:Homo sapiens (Human)
Description:P31645
Residue:630
BDBM50243895
NameBDBM50243895
Synonyms:1-(3,4-dichlorophenyl)-3-aza-bicyclo[3.1.0]hexane CHEMBL528995
TypeSmall organic molecule
Emp. Form.C11H11Cl2N
Mol. Mass.228.118
SMILESClc1ccc(cc1Cl)C12CC1CNC2