Reaction Details
TargetSodium-dependent serotonin transporter
LigandBDBM50334787
Substrate/Competitorn/a
Meas. Tech.ChEMBL_699304 (CHEMBL1647124)
IC50 2±n/a nM
Citation Shao, LWang, FMalcolm, SCMa, JHewitt, MCCampbell, UCBush, LRSpicer, NAEngel, SRSaraswat, LDHardy, LWKoch, PSchreiber, RSpear, KLVarney, MA Synthesis and pharmacological evaluation of 4-(3,4-dichlorophenyl)-N-methyl-1,2,3,4-tetrahydronaphthalenyl amines as triple reuptake inhibitors. Bioorg Med Chem19:663-76 (2011) 
 
Sodium-dependent serotonin transporter
Name:Sodium-dependent serotonin transporter
Type:Multi-pass membrane protein
Mol. Mass.:70322.51
Organism:Homo sapiens (Human)
Description:P31645
Residue:630
BDBM50334787
NameBDBM50334787
Synonyms:CHEMBL1642902 | cis-((2S,4S)-4-(3,4-dichlorophenyl)-1,2,3,4-tetrahydronaphthalen-2-yl)methanamine
TypeSmall organic molecule
Emp. Form.C17H17Cl2N
Mol. Mass.306.23
SMILESNC[C@H]1C[C@@H](c2ccc(Cl)c(Cl)c2)c2ccccc2C1