Reaction Details
TargetCytochrome P450 11B1, mitochondrial
LigandBDBM3787
Substrate/Competitorn/a
Meas. Tech.ChEMBL_701593 (CHEMBL1656352)
IC50 246±n/a nM
Citation Hille, UEZimmer, CVock, CAHartmann, RW First Selective CYP11B1 Inhibitors for the Treatment of Cortisol-Dependent Diseases ACS Med Chem Lett2:2-6 (2011) 
 
Cytochrome P450 11B1, mitochondrial
Name:Cytochrome P450 11B1, mitochondrial
Type:Enzyme
Mol. Mass.:57591.44
Organism:Homo sapiens (Human)
Description:P15538
Residue:503
BDBM3787
NameBDBM3787
Synonyms:1-Phenylbenzimidazole deriv. 4 | 1-benzyl-1H-1,3-benzodiazole
TypeSmall organic molecule
Emp. Form.C14H12N2
Mol. Mass.208.2585
SMILESC(c1ccccc1)n1cnc2ccccc12