Reaction Details
TargetCytochrome P450 11B1, mitochondrial
LigandBDBM31768
Substrate/Competitorn/a
Meas. Tech.ChEMBL_701593 (CHEMBL1656352)
IC50 127±n/a nM
Citation Hille, UEZimmer, CVock, CAHartmann, RW First Selective CYP11B1 Inhibitors for the Treatment of Cortisol-Dependent Diseases ACS Med Chem Lett2:2-6 (2011) 
 
Cytochrome P450 11B1, mitochondrial
Name:Cytochrome P450 11B1, mitochondrial
Type:Enzyme
Mol. Mass.:57591.44
Organism:Homo sapiens (Human)
Description:P15538
Residue:503
BDBM31768
NameBDBM31768
Synonyms:CHEMBL295698 Nizoral | Panfungol
TypeSmall organic molecule
Emp. Form.C26H28Cl2N4O4
Mol. Mass.531.431
SMILESCC(=O)N1CCN(CC1)c1ccc(OC[C@@H]2CO[C@](Cn3ccnc3)(O2)c2ccc(Cl)cc2Cl)cc1