Reaction Details
TargetMitogen-activated protein kinase 14
LigandBDBM50413752
Substrate/Competitorn/a
Meas. Tech.ChEMBL_701649 (CHEMBL1656541)
IC50>10000±n/a nM
Citation Liniger, MNeuhaus, CHofmann, TFransioli-Ignazio, LJordi, MDrueckes, PTrappe, JsFabbro, D Kinase Inhibition by Deoxy Analogues of the Resorcylic Lactone L-783277 ACS Med Chem Lett2:22-27 (2011) 
 
Mitogen-activated protein kinase 14
Name:Mitogen-activated protein kinase 14
Type:Serine/threonine-protein kinase
Mol. Mass.:41286.76
Organism:Homo sapiens (Human)
Description:Q16539
Residue:360
BDBM50413752
NameBDBM50413752
Synonyms:CHEMBL2012519 | L-783277
TypeSmall organic molecule
Emp. Form.C19H24O7
Mol. Mass.364.3897
SMILESCOc1cc(O)c2c(CCCC(=O)C(=O)C(O)CCC[C@H](C)OC2=O)c1