Reaction Details
TargetRho-associated protein kinase 2
LigandBDBM50335374
Substrate/Competitorn/a
Meas. Tech.ChEMBL_701647 (CHEMBL1656539)
IC50>10000±n/a nM
Citation Liniger, MNeuhaus, CHofmann, TFransioli-Ignazio, LJordi, MDrueckes, PTrappe, JsFabbro, D Kinase Inhibition by Deoxy Analogues of the Resorcylic Lactone L-783277 ACS Med Chem Lett2:22-27 (2011) 
 
Rho-associated protein kinase 2
Name:Rho-associated protein kinase 2
Type:Protein
Mol. Mass.:160885.43
Organism:Homo sapiens (Human)
Description:O75116
Residue:1388
BDBM50335374
NameBDBM50335374
Synonyms:(3S,9S)-9,16-dihydroxy-14-methoxy-3-methyl-3,4,9,10,11,12-hexahydro-1H-benzo[c][1]oxacyclotetradecine-1,7(8H)-dione CHEMBL1651522
TypeSmall organic molecule
Emp. Form.C19H24O6
Mol. Mass.348.3903
SMILESCOc1cc(O)c2c(CCC[C@H](O)CC(=O)C=CC[C@H](C)OC2=O)c1