Reaction Details
TargetEphrin type-B receptor 4
LigandBDBM50335374
Substrate/Competitorn/a
Meas. Tech.ChEMBL_701614 (CHEMBL1656373)
IC50 7400±n/a nM
Citation Liniger, MNeuhaus, CHofmann, TFransioli-Ignazio, LJordi, MDrueckes, PTrappe, JsFabbro, D Kinase Inhibition by Deoxy Analogues of the Resorcylic Lactone L-783277 ACS Med Chem Lett2:22-27 (2011) 
 
Ephrin type-B receptor 4
Name:Ephrin type-B receptor 4
Type:Enzyme
Mol. Mass.:108273.51
Organism:Homo sapiens (Human)
Description:P54760
Residue:987
BDBM50335374
NameBDBM50335374
Synonyms:(3S,9S)-9,16-dihydroxy-14-methoxy-3-methyl-3,4,9,10,11,12-hexahydro-1H-benzo[c][1]oxacyclotetradecine-1,7(8H)-dione CHEMBL1651522
TypeSmall organic molecule
Emp. Form.C19H24O6
Mol. Mass.348.3903
SMILESCOc1cc(O)c2c(CCC[C@H](O)CC(=O)C=CC[C@H](C)OC2=O)c1