Reaction Details
TargetVascular endothelial growth factor receptor 2
LigandBDBM50335374
Substrate/Competitorn/a
Meas. Tech.ChEMBL_701623 (CHEMBL1656382)
IC50 5.8±n/a nM
Citation Liniger, MNeuhaus, CHofmann, TFransioli-Ignazio, LJordi, MDrueckes, PTrappe, JsFabbro, D Kinase Inhibition by Deoxy Analogues of the Resorcylic Lactone L-783277 ACS Med Chem Lett2:22-27 (2011) 
 
Vascular endothelial growth factor receptor 2
Name:Vascular endothelial growth factor receptor 2
Type:Receptor Tyrosine Kinase
Mol. Mass.:151510.97
Organism:Homo sapiens (Human)
Description:P35968
Residue:1356
BDBM50335374
NameBDBM50335374
Synonyms:(3S,9S)-9,16-dihydroxy-14-methoxy-3-methyl-3,4,9,10,11,12-hexahydro-1H-benzo[c][1]oxacyclotetradecine-1,7(8H)-dione CHEMBL1651522
TypeSmall organic molecule
Emp. Form.C19H24O6
Mol. Mass.348.3903
SMILESCOc1cc(O)c2c(CCC[C@H](O)CC(=O)C=CC[C@H](C)OC2=O)c1