Reaction Details
TargetMast/stem cell growth factor receptor Kit
LigandBDBM50335376
Substrate/Competitorn/a
Meas. Tech.ChEMBL_701615 (CHEMBL1656374)
IC50>10000±n/a nM
Citation Liniger, MNeuhaus, CHofmann, TFransioli-Ignazio, LJordi, MDrueckes, PTrappe, JsFabbro, D Kinase Inhibition by Deoxy Analogues of the Resorcylic Lactone L-783277 ACS Med Chem Lett2:22-27 (2011) 
 
Mast/stem cell growth factor receptor Kit
Name:Mast/stem cell growth factor receptor Kit
Type:Protein
Mol. Mass.:109869.37
Organism:Homo sapiens (Human)
Description:P10721
Residue:976
BDBM50335376
NameBDBM50335376
Synonyms:(S)-16-hydroxy-14-methoxy-3-methyl-3,4,9,10,11,12-hexahydro-1H-benzo[c][1]oxacyclotetradecine-1,7(8H)-dione CHEMBL1651523
TypeSmall organic molecule
Emp. Form.C19H24O5
Mol. Mass.332.3909
SMILESCOc1cc(O)c2c(CCCCCC(=O)C=CC[C@H](C)OC2=O)c1