Reaction Details
TargetMAP kinase-activated protein kinase 5
LigandBDBM50335376
Substrate/Competitorn/a
Meas. Tech.ChEMBL_701618 (CHEMBL1656377)
IC50>10000±n/a nM
Citation Liniger, MNeuhaus, CHofmann, TFransioli-Ignazio, LJordi, MDrueckes, PTrappe, JsFabbro, D Kinase Inhibition by Deoxy Analogues of the Resorcylic Lactone L-783277 ACS Med Chem Lett2:22-27 (2011) 
 
MAP kinase-activated protein kinase 5
Name:MAP kinase-activated protein kinase 5
Type:Serine/threonine-protein kinase
Mol. Mass.:54229.92
Organism:Homo sapiens (Human)
Description:Recombinant MAPKAPK5 was phosphorylated by incubation with active p38alpha before assays.
Residue:473
BDBM50335376
NameBDBM50335376
Synonyms:(S)-16-hydroxy-14-methoxy-3-methyl-3,4,9,10,11,12-hexahydro-1H-benzo[c][1]oxacyclotetradecine-1,7(8H)-dione CHEMBL1651523
TypeSmall organic molecule
Emp. Form.C19H24O5
Mol. Mass.332.3909
SMILESCOc1cc(O)c2c(CCCCCC(=O)C=CC[C@H](C)OC2=O)c1