Reaction Details
TargetLysosomal alpha-glucosidase
LigandBDBM50335389
Substrate/Competitorn/a
Meas. Tech.ChEMBL_701785 (CHEMBL1656922)
IC50 7000±n/a nM
Citation Ghisaidoobe, ABikker, Pde Bruijn, ACGodschalk, FDRogaar, EGuijt, MCHagens, PHalma, JMHart, SMLuitjens, SBvan Rixel, VHWijzenbroek, MZweegers, TDonker-Koopman, WEStrijland, ABoot, RMarel, GvOverkleeft, HSAerts, JM Identification of Potent and Selective Glucosylceramide Synthase Inhibitors from a Library of N-Alkylated Iminosugars ACS Med Chem Lett2:119-123 (2011) 
 
Lysosomal alpha-glucosidase
Name:Lysosomal alpha-glucosidase
Type:Enzyme
Mol. Mass.:106235.32
Organism:Mus musculus (Mouse)
Description:P70699
Residue:953
BDBM50335389
NameBDBM50335389
Synonyms:CHEMBL1651631 | N-Heptoxypentyl-1-deoxynojirimycin
TypeSmall organic molecule
Emp. Form.C18H37NO5
Mol. Mass.347.4901
1C[C@H](O)[C@@H](O)[C@H](O)[C@H]1CO