Reaction Details
TargetLysosomal alpha-glucosidase
LigandBDBM18357
Substrate/Competitorn/a
Meas. Tech.ChEMBL_701785 (CHEMBL1656922)
IC50 8000±n/a nM
Citation Ghisaidoobe, ABikker, Pde Bruijn, ACGodschalk, FDRogaar, EGuijt, MCHagens, PHalma, JMHart, SMLuitjens, SBvan Rixel, VHWijzenbroek, MZweegers, TDonker-Koopman, WEStrijland, ABoot, RMarel, GvOverkleeft, HSAerts, JM Identification of Potent and Selective Glucosylceramide Synthase Inhibitors from a Library of N-Alkylated Iminosugars ACS Med Chem Lett2:119-123 (2011) 
 
Lysosomal alpha-glucosidase
Name:Lysosomal alpha-glucosidase
Type:Enzyme
Mol. Mass.:106235.32
Organism:Mus musculus (Mouse)
Description:P70699
Residue:953
BDBM18357
NameBDBM18357
Synonyms:(2R,3R,4R,5S)-2-(hydroxymethyl)-1-octylpiperidine-3,4,5-triol | N-Octyl-DNJ
TypeSmall organic molecule
Emp. Form.C14H29NO4
Mol. Mass.275.3844
SMILESCCCCCCCCN1C[C@H](O)[C@@H](O)[C@H](O)[C@H]1CO