Reaction Details
TargetNon-lysosomal glucosylceramidase
LigandBDBM50299749
Substrate/Competitorn/a
Meas. Tech.ChEMBL_701782 (CHEMBL1656919)
IC50 1±n/a nM
Citation Ghisaidoobe, ABikker, Pde Bruijn, ACGodschalk, FDRogaar, EGuijt, MCHagens, PHalma, JMHart, SMLuitjens, SBvan Rixel, VHWijzenbroek, MZweegers, TDonker-Koopman, WEStrijland, ABoot, RMarel, GvOverkleeft, HSAerts, JM Identification of Potent and Selective Glucosylceramide Synthase Inhibitors from a Library of N-Alkylated Iminosugars ACS Med Chem Lett2:119-123 (2011) 
 
Non-lysosomal glucosylceramidase
Name:Non-lysosomal glucosylceramidase
Type:PROTEIN
Mol. Mass.:104639.04
Organism:Homo sapiens (Human)
Description:ChEMBL_1435476
Residue:927
BDBM50299749
NameBDBM50299749
Synonyms:(2R,3R,4R,5S)-1-[5-(Adamantan-1-ylmethoxy)-pentyl]-2-hydroxymethyl-piperidine-3,4,5-triol N-adamantanemethyloxypentyl-1-deoxynojirimycin
TypeSmall organic molecule
Emp. Form.C22H39NO5
Mol. Mass.397.5488
SMILESOC[C@@H]1[C@@H](O)[C@H](O)[C@@H](O)CN1CCCCCOCC12CC3CC(CC(C3)C1)C2