Reaction Details
TargetCeramide glucosyltransferase
LigandBDBM50335383
Substrate/Competitorn/a
Meas. Tech.ChEMBL_701780 (CHEMBL1656917)
IC50 50±n/a nM
Citation Ghisaidoobe, ABikker, Pde Bruijn, ACGodschalk, FDRogaar, EGuijt, MCHagens, PHalma, JMHart, SMLuitjens, SBvan Rixel, VHWijzenbroek, MZweegers, TDonker-Koopman, WEStrijland, ABoot, RMarel, GvOverkleeft, HSAerts, JM Identification of Potent and Selective Glucosylceramide Synthase Inhibitors from a Library of N-Alkylated Iminosugars ACS Med Chem Lett2:119-123 (2011) 
 
Ceramide glucosyltransferase
Name:Ceramide glucosyltransferase
Type:PROTEIN
Mol. Mass.:44844.15
Organism:Mus musculus
Description:ChEMBL_809643
Residue:394
BDBM50335383
NameBDBM50335383
Synonyms:CHEMBL1651637 | N-Heptoxypentyl-L-ido-1-deoxynojirimycin
TypeSmall organic molecule
Emp. Form.C18H37NO5
Mol. Mass.347.4901
1C[C@H](O)[C@@H](O)[C@H](O)[C@@H]1CO