Reaction Details
TargetSphingosine 1-phosphate receptor 3
LigandBDBM22203
Substrate/Competitorn/a
Meas. Tech.ChEMBL_701954 (CHEMBL1657526)
IC50>10±n/a nM
Citation Saha, AKYu, XLin, JLobera, MSharadendu, AChereku, SSchutz, NSegal, DMarantz, YMcCauley, DMiddleton, SSiu, JBörli, RWBuys, JHorner, MSalyers, KSchrag, MVargas, HMXu, YMcElvain, M Benzofuran Derivatives as Potent, Orally Active S1P1 Receptor Agonists: A Preclinical Lead Molecule for MS ACS Med Chem Lett2:97-101 (2011) 
 
Sphingosine 1-phosphate receptor 3
Name:Sphingosine 1-phosphate receptor 3
Type:G Protein-Coupled Receptor (GPCR)
Mol. Mass.:42278.13
Organism:Homo sapiens (Human)
Description:Q99500
Residue:378
BDBM22203
NameBDBM22203
Synonyms:1,2,4-oxadiazole based compound, 13 1-{4-[3-(4-tert-butylphenyl)-1,2,4-oxadiazol-5-yl]benzyl}azetidine-3-carboxylic acid
TypeSmall organic molecule
Emp. Form.C23H25N3O3
Mol. Mass.391.4629
SMILESCC(C)(C)c1ccc(cc1)-c1noc(n1)-c1ccc(CN2CC(C2)C(O)=O)cc1