Reaction Details
TargetSphingosine 1-phosphate receptor 1
LigandBDBM50335455
Substrate/Competitorn/a
Meas. Tech.ChEMBL_701955 (CHEMBL1657527)
EC50 2000±n/a nM
Citation Saha, AKYu, XLin, JLobera, MSharadendu, AChereku, SSchutz, NSegal, DMarantz, YMcCauley, DMiddleton, SSiu, JBörli, RWBuys, JHorner, MSalyers, KSchrag, MVargas, HMXu, YMcElvain, M Benzofuran Derivatives as Potent, Orally Active S1P1 Receptor Agonists: A Preclinical Lead Molecule for MS ACS Med Chem Lett2:97-101 (2011) 
 
Sphingosine 1-phosphate receptor 1
Name:Sphingosine 1-phosphate receptor 1
Type:Enzyme
Mol. Mass.:42836.02
Organism:Homo sapiens (Human)
Description:P21453
Residue:382
BDBM50335455
NameBDBM50335455
Synonyms:1-(4-(6-butoxybenzofuran-2-yl)benzyl)azetidine-3-carboxylic acid | CHEMBL1651709
TypeSmall organic molecule
Emp. Form.C23H25NO4
Mol. Mass.379.4489
SMILESCCCCOc1ccc2cc(oc2c1)-c1ccc(CN2CC(C2)C(O)=O)cc1