Reaction Details
TargetSphingosine 1-phosphate receptor 3
LigandBDBM50335460
Substrate/Competitorn/a
Meas. Tech.ChEMBL_701956 (CHEMBL1657528)
EC50>25000±n/a nM
Citation Saha, AKYu, XLin, JLobera, MSharadendu, AChereku, SSchutz, NSegal, DMarantz, YMcCauley, DMiddleton, SSiu, JBörli, RWBuys, JHorner, MSalyers, KSchrag, MVargas, HMXu, YMcElvain, M Benzofuran Derivatives as Potent, Orally Active S1P1 Receptor Agonists: A Preclinical Lead Molecule for MS ACS Med Chem Lett2:97-101 (2011) 
 
Sphingosine 1-phosphate receptor 3
Name:Sphingosine 1-phosphate receptor 3
Type:G Protein-Coupled Receptor (GPCR)
Mol. Mass.:42278.13
Organism:Homo sapiens (Human)
Description:Q99500
Residue:378
BDBM50335460
NameBDBM50335460
Synonyms:1-((6-(5-cyclohexylbenzofuran-2-yl)pyridin-3-yl)methyl)azetidine-3-carboxylic acid | CHEMBL1651715
TypeSmall organic molecule
Emp. Form.C24H26N2O3
Mol. Mass.390.4748
SMILESOC(=O)C1CN(Cc2ccc(nc2)-c2cc3cc(ccc3o2)C2CCCCC2)C1