Reaction Details
TargetSphingosine 1-phosphate receptor 1
LigandBDBM50335506
Substrate/Competitorn/a
Meas. Tech.ChEMBL_702151 (CHEMBL1655488)
EC50 3980±n/a nM
Citation Cee, VJFrohn, MLanman, BAGolden, JMuller, KNeira, SPickrell, AArnett, HBuys, JGore, AFiorino, MHorner, MItano, ALee, MRMcElvain, MMiddleton, SSchrag, MRivenzon-Segal, DVargas, HMXu, HXu, YZhang, XSiu, JWong, M Discovery of AMG 369, a Thiazolo[5,4-b]pyridine Agonist of S1P1 and S1P5 ACS Med Chem Lett2:107-112 (2011) 
 
Sphingosine 1-phosphate receptor 1
Name:Sphingosine 1-phosphate receptor 1
Type:Enzyme
Mol. Mass.:42836.02
Organism:Homo sapiens (Human)
Description:P21453
Residue:382
BDBM50335506
NameBDBM50335506
Synonyms:1-(4-(6-benzylthiazolo[4,5-c]pyridin-2-yl)-3-fluorobenzyl)azetidine-3-carboxylic acid | CHEMBL1651856
TypeSmall organic molecule
Emp. Form.C24H20FN3O2S
Mol. Mass.433.498
SMILESOC(=O)C1CN(Cc2ccc(-c3nc4cnc(Cc5ccccc5)cc4s3)c(F)c2)C1