Reaction Details
TargetNeuraminidase
LigandBDBM4994
Substrate/Competitorn/a
Meas. Tech.ChEMBL_709403 (CHEMBL1667302)
IC50 0.100000±n/a nM
Citation Govorkova, EAIlyushina, NAMcClaren, JLNaipospos, TSDouangngeun, BWebster, RG Susceptibility of highly pathogenic H5N1 influenza viruses to the neuraminidase inhibitor oseltamivir differs in vitro and in a mouse model. Antimicrob Agents Chemother53:3088-96 (2009) 
 
Neuraminidase
Name:Neuraminidase
Synonyms:n/a
Type:PROTEIN
Mol. Mass.:49178.82
Organism:Influenza A virus
Description:ChEMBL_709408
Residue:449
BDBM4994
NameBDBM4994
TypeSmall organic molecule
Emp. Form.C14H24N2O4
Mol. Mass.284.3514
SMILESCCC(CC)O[C@@H]1C=C(C[C@H](N)[C@H]1NC(C)=O)C(O)=O