Reaction Details
TargetC-X-C chemokine receptor type 4
LigandBDBM50335557
Substrate/Competitorn/a
Meas. Tech.ChEMBL_708504 (CHEMBL1666318)
IC50 2.8±n/a nM
Citation Murakami, TKumakura, SYamazaki, TTanaka, RHamatake, MOkuma, KHuang, WToma, JKomano, JYanaka, MTanaka, YYamamoto, N The novel CXCR4 antagonist KRH-3955 is an orally bioavailable and extremely potent inhibitor of human immunodeficiency virus type 1 infection: comparative studies with AMD3100. Antimicrob Agents Chemother53:2940-8 (2009) 
 
C-X-C chemokine receptor type 4
Name:C-X-C chemokine receptor type 4
Type:Enzyme
Mol. Mass.:39754.61
Organism:Homo sapiens (Human)
Description:P61073
Residue:352
BDBM50335557
NameBDBM50335557
Synonyms:CHEMBL1652605 | N,N-dipropyl-N'-[4-({[(1H-imidazol-2-yl)methyl][(1-methyl-1H-imidazol-2-yl)methyl]amino}methyl)benzyl]-N'-methylbutane-1,4-diamine tri-(2R,3R)-tartrate
TypeSmall organic molecule
Emp. Form.C28H45N7
Mol. Mass.479.7038
SMILESCCCN(CCC)CCCCN(C)Cc1ccc(CN(Cc2ncc[nH]2)Cc2nccn2C)cc1