Reaction Details
TargetBeta-lactamase
LigandBDBM50240480
Substrate/Competitorn/a
Meas. Tech.ChEMBL_715807 (CHEMBL1663882)
Ki 7±n/a nM
Citation Rodríguez-Martínez, JMNordmann, PRonco, EPoirel, L Extended-spectrum cephalosporinase in Acinetobacter baumannii. Antimicrob Agents Chemother54:3484-8 (2010) 
 
Beta-lactamase
Name:Beta-lactamase
Synonyms:Beta-lactamase ADC-33
Type:PROTEIN
Mol. Mass.:40551.94
Organism:Acinetobacter baumannii
Description:ChEMBL_715812
Residue:359
BDBM50240480
NameBDBM50240480
TypeSmall organic molecule
Emp. Form.C13H17N5O8S2
Mol. Mass.435.433
SMILESC[C@H]1[C@H](NC(=O)C(=N/OC(C)(C)C(O)=O)\c2csc(N)n2)C(=O)N1S(O)(=O)=O