Reaction Details
TargetBeta-lactamase
LigandBDBM50335523
Substrate/Competitorn/a
Meas. Tech.ChEMBL_715807 (CHEMBL1663882)
Ki 500±n/a nM
Citation Rodríguez-Martínez, JMNordmann, PRonco, EPoirel, L Extended-spectrum cephalosporinase in Acinetobacter baumannii. Antimicrob Agents Chemother54:3484-8 (2010) 
 
Beta-lactamase
Name:Beta-lactamase
Synonyms:Beta-lactamase ADC-33
Type:PROTEIN
Mol. Mass.:40551.94
Organism:Acinetobacter baumannii
Description:ChEMBL_715812
Residue:359
BDBM50335523
NameBDBM50335523
TypeSmall organic molecule
Emp. Form.C16H17N5O7S2
Mol. Mass.455.465
SMILESCO\N=C(\C(=O)N[C@H]1[C@H]2SCC(COC(C)=O)=C(N2C1=O)C(O)=O)c1csc(N)n1