Reaction Details
TargetMitogen-activated protein kinase 14
LigandBDBM50153015
Substrate/Competitorn/a
Meas. Tech.ChEMBL_715139 (CHEMBL1664298)
IC50 1470±n/a nM
Citation Schmidt, CAMurillo, RBruhn, TBringmann, GGoettert, MHeinzmann, BBrecht, VLaufer, SAMerfort, I Catechin derivatives from Parapiptadenia rigida with in vitro wound-healing properties. J Nat Prod73:2035-41 (2010) 
 
Mitogen-activated protein kinase 14
Name:Mitogen-activated protein kinase 14
Type:Serine/threonine-protein kinase
Mol. Mass.:41286.76
Organism:Homo sapiens (Human)
Description:Q16539
Residue:360
BDBM50153015
NameBDBM50153015
Synonyms:(-)-Epicatechin-3-gallate (-)-epicatechin gallate (-)epicatechingallate (2R,3R)-2-(3,4-dihydroxyphenyl)-5,7-dihydroxychroman-3-yl 3,4,5-trihydroxybenzoate 3,4,5-Trihydroxy-benzoic acid 2-(3,4-dihydroxy-phenyl)-5,7-dihydroxy-chroman-3-yl ester Epicatechin gallate | Epicatechin-3-O-gallate
TypeSmall organic molecule
Emp. Form.C22H18O10
Mol. Mass.442.3723
SMILESOc1cc(O)c2C[C@@H](OC(=O)c3cc(O)c(O)c(O)c3)[C@H](Oc2c1)c1ccc(O)c(O)c1